Target
Interleukin-1 receptor-associated kinase 3
Ligand
BDBM26300
Substrate
Meas. Tech.
ChEMBL_774546 (CHEMBL1908763)
Kd
7900±n/a nM
Citation
 Davis, MIHunt, JPHerrgard, SCiceri, PWodicka, LMPallares, GHocker, MTreiber, DKZarrinkar, PP Comprehensive analysis of kinase inhibitor selectivity. Nat Biotechnol 29:1046-51 (2011)  
Target
Name:
Interleukin-1 receptor-associated kinase 3
Synonyms:
IL-1 receptor-associated kinase M IRAK-M IRAK3_HUMAN
Type:
PROTEIN
Mol. Mass.:
67767.98
Organism:
Homo sapiens (Human)
Description:
EBI_101055
Residue:
596
  
Inhibitor
Name:
BDBM26300
Synonyms:
2-{3-[(7-{3-[ethyl(2-hydroxyethyl)amino]propoxy}quinazolin-4-yl)amino]-1H-pyrazol-5-yl}-N-(3-fluorophenyl)acetamide cid_16007391 | pyrazoloquinazoline deriv., 34
Type:
Small organic molecule
Emp. Form.:
C26H30FN7O3
Mol. Mass.:
507.5599
SMILES:
CCN(CCO)CCCOc1ccc2c(Nc3cc(CC(=O)Nc4cccc(F)c4)n[nH]3)ncnc2c1
: