Target
Death-associated protein kinase 1
Ligand
BDBM50331096
Substrate
Meas. Tech.
ChEMBL_774451 (CHEMBL1908668)
Kd
>10000±n/a nM
Citation
 Davis, MIHunt, JPHerrgard, SCiceri, PWodicka, LMPallares, GHocker, MTreiber, DKZarrinkar, PP Comprehensive analysis of kinase inhibitor selectivity. Nat Biotechnol 29:1046-51 (2011)  
Target
Name:
Death-associated protein kinase 1
Synonyms:
Cellular tumor antigen p53/Death-associated protein kinase 1 DAPK DAPK1_HUMAN Death-associated protein kinase 1 (DAPK1) Death-associated protein kinase 3 (DAPK3)
Type:
PROTEIN
Mol. Mass.:
160053.35
Organism:
Homo sapiens (Human)
Description:
ChEMBL_1517177
Residue:
1430
  
Inhibitor
Name:
BDBM50331096
Synonyms:
4-(4-fluoro-2-methyl-1H-indol-5-yloxy)-6-methoxy-7-(3-(pyrrolidin-1-yl)propoxy)quinazoline Cediranib ZD-2171
Type:
Small organic molecule
Emp. Form.:
C25H27FN4O3
Mol. Mass.:
450.5053
SMILES:
COc1cc2c(Oc3ccc4[nH]c(C)cc4c3F)ncnc2cc1OCCCN1CCCC1
: