Target
Interleukin-1 receptor-associated kinase 3
Ligand
BDBM15244
Substrate
Meas. Tech.
ChEMBL_774546 (CHEMBL1908763)
Kd
>10000±n/a nM
Citation
 Davis, MIHunt, JPHerrgard, SCiceri, PWodicka, LMPallares, GHocker, MTreiber, DKZarrinkar, PP Comprehensive analysis of kinase inhibitor selectivity. Nat Biotechnol 29:1046-51 (2011)  
Target
Name:
Interleukin-1 receptor-associated kinase 3
Synonyms:
IL-1 receptor-associated kinase M IRAK-M IRAK3_HUMAN
Type:
PROTEIN
Mol. Mass.:
67767.98
Organism:
Homo sapiens (Human)
Description:
EBI_101055
Residue:
596
  
Inhibitor
Name:
BDBM15244
Synonyms:
5-(2,6-dichlorophenyl)-2-(2,4-difluorophenyl)sulfanylpyrimido[1,6-b]pyridazin-6-one 5-(2,6-dichlorophenyl)-2-[(2,4-difluorophenyl)thio]-6-pyrimido[1,6-b]pyridazinone 5-(2,6-dichlorophenyl)-9-(2,4-difluorophenyl)sulfanyl-1,3,10-triazabicyclo[4.4.0]deca-2,5,7,9-tetraen-4-one VX-745 cid_3038525
Type:
Small organic molecule
Emp. Form.:
C19H9Cl2F2N3OS
Mol. Mass.:
436.262
SMILES:
Fc1ccc(Sc2ccc3c(-c4c(Cl)cccc4Cl)c(=O)ncn3n2)c(F)c1
: