Target
Cyclin-dependent kinase 4
Ligand
BDBM15138
Substrate
Meas. Tech.
ChEMBL_774260 (CHEMBL1908477)
Kd
>10000±n/a nM
Citation
 Davis, MIHunt, JPHerrgard, SCiceri, PWodicka, LMPallares, GHocker, MTreiber, DKZarrinkar, PP Comprehensive analysis of kinase inhibitor selectivity. Nat Biotechnol 29:1046-51 (2011)  
Target
Name:
Cyclin-dependent kinase 4
Synonyms:
CDK4 Cell division protein kinase 4 PSK-J3
Type:
Enzyme Subunit
Mol. Mass.:
33731.96
Organism:
Homo sapiens (Human)
Description:
P11802
Residue:
303
  
Inhibitor
Name:
BDBM15138
Synonyms:
5-indazolyl pyridine 11g A-674563 indazole-pyridine, 7
Type:
Small organic molecule
Emp. Form.:
C22H22N4O
Mol. Mass.:
358.4363
SMILES:
Cc1n[nH]c2ccc(cc12)-c1cncc(OC[C@@H](N)Cc2ccccc2)c1
: