Target
Cyclin-dependent kinase 11A
Ligand
BDBM60589
Substrate
Meas. Tech.
ChEMBL_774613 (CHEMBL1908830)
Kd
>10000±n/a nM
Citation
 Davis, MIHunt, JPHerrgard, SCiceri, PWodicka, LMPallares, GHocker, MTreiber, DKZarrinkar, PP Comprehensive analysis of kinase inhibitor selectivity. Nat Biotechnol 29:1046-51 (2011)  
Target
Name:
Cyclin-dependent kinase 11A
Synonyms:
CD11A_HUMAN CDC2L3 Cell division cycle 2-like protein kinase 2 Galactosyltransferase-associated protein kinase p58/GTA PITSLREB
Type:
PROTEIN
Mol. Mass.:
91334.31
Organism:
Homo sapiens (Human)
Description:
ChEMBL_774613
Residue:
783
  
Inhibitor
Name:
BDBM60589
Synonyms:
6-{[6-(1-methyl-1H-pyrazol-4-yl)-[1,2,4]triazolo[4,3-b]pyridazin-3-yl]sulfanyl}quinoline (4) | BDBM50355498
Type:
Emp. Form.:
C18H13N7S
Mol. Mass.:
359.408
SMILES:
Cn1cc(cn1)-c1ccc2nnc(Sc3ccc4ncccc4c3)n2n1
: