Target
Serine/threonine-protein kinase TNNI3K
Ligand
BDBM60589
Substrate
Meas. Tech.
ChEMBL_774577 (CHEMBL1908794)
Kd
>10000±n/a nM
Citation
 Davis, MIHunt, JPHerrgard, SCiceri, PWodicka, LMPallares, GHocker, MTreiber, DKZarrinkar, PP Comprehensive analysis of kinase inhibitor selectivity. Nat Biotechnol 29:1046-51 (2011)  
Target
Name:
Serine/threonine-protein kinase TNNI3K
Synonyms:
CARK TNI3K_HUMAN | TNNI3K
Type:
Enzyme Catalytic Domain
Mol. Mass.:
92855.14
Organism:
Homo sapiens (Human)
Description:
gi_7705748
Residue:
835
  
Inhibitor
Name:
BDBM60589
Synonyms:
6-{[6-(1-methyl-1H-pyrazol-4-yl)-[1,2,4]triazolo[4,3-b]pyridazin-3-yl]sulfanyl}quinoline (4) | BDBM50355498
Type:
Emp. Form.:
C18H13N7S
Mol. Mass.:
359.408
SMILES:
Cn1cc(cn1)-c1ccc2nnc(Sc3ccc4ncccc4c3)n2n1
: