Target
cGMP-dependent protein kinase 1
Ligand
BDBM27817
Substrate
Meas. Tech.
ChEMBL_774532 (CHEMBL1908749)
Kd
>10000±n/a nM
Citation
 Davis, MIHunt, JPHerrgard, SCiceri, PWodicka, LMPallares, GHocker, MTreiber, DKZarrinkar, PP Comprehensive analysis of kinase inhibitor selectivity. Nat Biotechnol 29:1046-51 (2011)  
Target
Name:
cGMP-dependent protein kinase 1
Synonyms:
GMP-dependent protein kinase I PRKG1 PRKGR1A Protein Kinase G cGMP-dependent protein kinase 1 | cGMP-dependent protein kinase 1 beta
Type:
Protein
Mol. Mass.:
76358.04
Organism:
Homo sapiens (Human)
Description:
Q13976
Residue:
671
  
Inhibitor
Name:
BDBM27817
Synonyms:
2-{[2-({1-[2-(dimethylamino)acetyl]-5-methoxy-2,3-dihydro-1H-indol-6-yl}amino)-7H-pyrrolo[2,3-d]pyrimidin-4-yl]amino}-6-fluoro-N-methylbenzamide | pyrrolo[2,3-d]pyrimidine deriv., 40
Type:
Small organic molecule
Emp. Form.:
C27H29FN8O3
Mol. Mass.:
532.5694
SMILES:
CNC(=O)c1c(F)cccc1Nc1nc(Nc2cc3N(CCc3cc2OC)C(=O)CN(C)C)nc2[nH]ccc12
: