Target
Cyclin-dependent kinase 4
Ligand
BDBM50355499
Substrate
Meas. Tech.
ChEMBL_774260 (CHEMBL1908477)
Kd
5000±n/a nM
Citation
 Davis, MIHunt, JPHerrgard, SCiceri, PWodicka, LMPallares, GHocker, MTreiber, DKZarrinkar, PP Comprehensive analysis of kinase inhibitor selectivity. Nat Biotechnol 29:1046-51 (2011)  
Target
Name:
Cyclin-dependent kinase 4
Synonyms:
CDK4 Cell division protein kinase 4 PSK-J3
Type:
Enzyme Subunit
Mol. Mass.:
33731.96
Organism:
Homo sapiens (Human)
Description:
P11802
Residue:
303
  
Inhibitor
Name:
BDBM50355499
Synonyms:
CHEMBL1908395 | CHEMBL1908842
Type:
Small organic molecule
Emp. Form.:
C26H32N6O2
Mol. Mass.:
460.5713
SMILES:
CN(C)CC(=O)N1CCC(CC1)c1ccc(NC(=O)c2ncc([nH]2)C#N)c(c1)C1=CCCCC1
: