Target
Epidermal growth factor receptor
Ligand
BDBM50322823
Substrate
Meas. Tech.
ChEMBL_774482 (CHEMBL1908699)
Kd
0.120000±n/a nM
Citation
 Davis, MIHunt, JPHerrgard, SCiceri, PWodicka, LMPallares, GHocker, MTreiber, DKZarrinkar, PP Comprehensive analysis of kinase inhibitor selectivity. Nat Biotechnol 29:1046-51 (2011)  
Target
Name:
Epidermal growth factor receptor
Synonyms:
EGF Receptor Substrate EGFR_HUMAN ERBB1 Epidermal Growth Factor Receptor erbB-1 Epidermal growth factor receptor (EGFR) HER1 Proto-oncogene c-ErbB-1 Tyrosine-Protein Kinase ErbB-1
Type:
Receptor Kinase Domain
Mol. Mass.:
134279.59
Organism:
Homo sapiens (Human)
Description:
P00533
Residue:
1210
  
Inhibitor
Name:
BDBM50322823
Synonyms:
(S)-N-(4-(3-chloro-4-fluorophenylamino)-7-(tetrahydrofuran-3-yloxy)quinazolin-6-yl)-4-(dimethylamino)but-2-enamide CHEMBL1173655 US10196365, Afatinib US11896597, Compound Afatinib US9890168, Compound BIBW2992 | WO2022090481, Example afatinib
Type:
Small organic molecule
Emp. Form.:
C24H25ClFN5O3
Mol. Mass.:
485.938
SMILES:
CN(C)C\C=C\C(=O)Nc1cc2c(Nc3ccc(F)c(Cl)c3)ncnc2cc1O[C@H]1CCOC1
: