Target
Proto-oncogene tyrosine-protein kinase receptor Ret
Ligand
BDBM50355501
Substrate
Meas. Tech.
ChEMBL_774601 (CHEMBL1908818)
Kd
720±n/a nM
Citation
 Davis, MIHunt, JPHerrgard, SCiceri, PWodicka, LMPallares, GHocker, MTreiber, DKZarrinkar, PP Comprehensive analysis of kinase inhibitor selectivity. Nat Biotechnol 29:1046-51 (2011)  
Target
Name:
Proto-oncogene tyrosine-protein kinase receptor Ret
Synonyms:
CDHF12 Cadherin family member 12 Proto-oncogene c-Ret RET51 Tyrosine-protein kinase Ret (RET)
Type:
Protein
Mol. Mass.:
124318.29
Organism:
Homo sapiens (Human)
Description:
P07949
Residue:
1114
  
Inhibitor
Name:
BDBM50355501
Synonyms:
INCB-018424 RUXOLITINIB PHOSPHATE US10766894, Compound TABLE 1.1 US11203595, TABLE 1.1 | US11279703, TABLE 6.147
Type:
Small organic molecule
Emp. Form.:
C17H18N6
Mol. Mass.:
306.365
SMILES:
N#CC[C@H](C1CCCC1)n1cc(cn1)-c1ncnc2[nH]ccc12
: