Target
Cyclin-dependent kinase-like 5
Ligand
BDBM50355494
Substrate
Meas. Tech.
ChEMBL_774385 (CHEMBL1908602)
Kd
>10000±n/a nM
Citation
 Davis, MIHunt, JPHerrgard, SCiceri, PWodicka, LMPallares, GHocker, MTreiber, DKZarrinkar, PP Comprehensive analysis of kinase inhibitor selectivity. Nat Biotechnol 29:1046-51 (2011)  
Target
Name:
Cyclin-dependent kinase-like 5
Synonyms:
CDKL5 STK9 | Serine/threonine-protein kinase 9
Type:
PROTEIN
Mol. Mass.:
115595.39
Organism:
Homo sapiens (Human)
Description:
ChEMBL_655722
Residue:
1030
  
Inhibitor
Name:
BDBM50355494
Synonyms:
CHEMBL1908396
Type:
Small organic molecule
Emp. Form.:
C24H24N4O5S
Mol. Mass.:
480.536
SMILES:
COc1cc(Oc2ccnc3cc(OC)c(OC)cc23)ccc1NC(=O)NC(C)c1nccs1
: