Target
Cyclin-dependent kinase-like 5
Ligand
BDBM5446
Substrate
Meas. Tech.
ChEMBL_774385 (CHEMBL1908602)
Kd
>10000±n/a nM
Citation
 Davis, MIHunt, JPHerrgard, SCiceri, PWodicka, LMPallares, GHocker, MTreiber, DKZarrinkar, PP Comprehensive analysis of kinase inhibitor selectivity. Nat Biotechnol 29:1046-51 (2011)  
Target
Name:
Cyclin-dependent kinase-like 5
Synonyms:
CDKL5 STK9 | Serine/threonine-protein kinase 9
Type:
PROTEIN
Mol. Mass.:
115595.39
Organism:
Homo sapiens (Human)
Description:
ChEMBL_655722
Residue:
1030
  
Inhibitor
Name:
BDBM5446
Synonyms:
CHEMBL553 Erlotinib N-(3-Ethynylphenyl)-6,7-bis(2-methoxyethoxy)-4-quinazolinamine Monohydrochloride OSI-774 US10189853, erlotinib US11524945, Compound Erlotinib US9730934, Erlotinib cid_176870
Type:
Small organic molecule
Emp. Form.:
C22H23N3O4
Mol. Mass.:
393.4357
SMILES:
COCCOc1cc2ncnc(Nc3cccc(c3)C#C)c2cc1OCCOC
: