Target
Death-associated protein kinase 2
Ligand
BDBM50355495
Substrate
Meas. Tech.
ChEMBL_774557 (CHEMBL1908774)
Kd
>10000±n/a nM
Citation
 Davis, MIHunt, JPHerrgard, SCiceri, PWodicka, LMPallares, GHocker, MTreiber, DKZarrinkar, PP Comprehensive analysis of kinase inhibitor selectivity. Nat Biotechnol 29:1046-51 (2011)  
Target
Name:
Death-associated protein kinase 2
Synonyms:
DAP kinase 2 DAPK2 DRP-1
Type:
PROTEIN
Mol. Mass.:
42900.09
Organism:
Homo sapiens (Human)
Description:
ChEMBL_774557
Residue:
370
  
Inhibitor
Name:
BDBM50355495
Synonyms:
CHEMBL1908391
Type:
Small organic molecule
Emp. Form.:
C28H30N6OS
Mol. Mass.:
498.642
SMILES:
CN1CCN(Cc2ccc(cc2)C(=O)Nc2ccc(C)c(Nc3nc(cs3)-c3cccnc3)c2)CC1
: