Target
Cyclin-dependent kinase-like 5
Ligand
BDBM482158
Substrate
Meas. Tech.
ChEMBL_774385 (CHEMBL1908602)
Kd
>10000±n/a nM
Citation
 Davis, MIHunt, JPHerrgard, SCiceri, PWodicka, LMPallares, GHocker, MTreiber, DKZarrinkar, PP Comprehensive analysis of kinase inhibitor selectivity. Nat Biotechnol 29:1046-51 (2011)  
Target
Name:
Cyclin-dependent kinase-like 5
Synonyms:
CDKL5 STK9 | Serine/threonine-protein kinase 9
Type:
PROTEIN
Mol. Mass.:
115595.39
Organism:
Homo sapiens (Human)
Description:
ChEMBL_655722
Residue:
1030
  
Inhibitor
Name:
BDBM482158
Synonyms:
BDBM50242742 | TAE684
Type:
Emp. Form.:
C30H40ClN7O3S
Mol. Mass.:
614.202
SMILES:
COc1cc(ccc1Nc1ncc(Cl)c(Nc2ccccc2S(=O)(=O)C(C)C)n1)N1CCC(CC1)N1CCN(C)CC1
: