Target
Tyrosine-protein kinase HCK
Ligand
BDBM36409
Substrate
Meas. Tech.
ChEMBL_774337 (CHEMBL1908554)
Kd
190±n/a nM
Citation
 Davis, MIHunt, JPHerrgard, SCiceri, PWodicka, LMPallares, GHocker, MTreiber, DKZarrinkar, PP Comprehensive analysis of kinase inhibitor selectivity. Nat Biotechnol 29:1046-51 (2011)  
Target
Name:
Tyrosine-protein kinase HCK
Synonyms:
HCK Hematopoietic cell kinase p59-HCK/p60-HCK p61Hck
Type:
Enzyme Catalytic Domain
Mol. Mass.:
59600.18
Organism:
Homo sapiens (Human)
Description:
P08631
Residue:
526
  
Inhibitor
Name:
BDBM36409
Synonyms:
2-(4-amino-1-isopropyl-1H-pyrazolo[3,4-d]pyrimidin-3-yl)-1H-indol-5-ol, PP242 US10172858, Table 2.1 | US9828378, # 1
Type:
Small organic molecule
Emp. Form.:
C16H16N6O
Mol. Mass.:
308.3378
SMILES:
CC(C)n1nc(-c2cc3cc(O)ccc3[nH]2)c2c(N)ncnc12
: