Target
Ephrin type-B receptor 4
Ligand
BDBM13530
Substrate
Meas. Tech.
ChEMBL_774436 (CHEMBL1908653)
Kd
>10000±n/a nM
Citation
 Davis, MIHunt, JPHerrgard, SCiceri, PWodicka, LMPallares, GHocker, MTreiber, DKZarrinkar, PP Comprehensive analysis of kinase inhibitor selectivity. Nat Biotechnol 29:1046-51 (2011)  
Target
Name:
Ephrin type-B receptor 4
Synonyms:
EPHB4 Ephrin receptor HTK MYK1 Tyrosine-protein kinase TYRO11 | VHL/Ephrin type-B receptor 4
Type:
Enzyme
Mol. Mass.:
108273.51
Organism:
Homo sapiens (Human)
Description:
P54760
Residue:
987
  
Inhibitor
Name:
BDBM13530
Synonyms:
4-[(4-methylpiperazin-1-yl)methyl]-N-[4-methyl-3-[(4-pyridin-3-ylpyrimidin-2-yl)amino]phenyl]benzamide Gleevec Imatinib, 21 STI-571 US10906896, Cpd imatinib US11725005, Compound imatinib cid_5291 med.21724, Compound 6
Type:
Small organic molecule
Emp. Form.:
C29H31N7O
Mol. Mass.:
493.6027
SMILES:
CN1CCN(Cc2ccc(cc2)C(=O)Nc2ccc(C)c(Nc3nccc(n3)-c3cccnc3)c2)CC1
: