Target
Protein kinase C iota type
Ligand
BDBM13534
Substrate
Meas. Tech.
ChEMBL_774363 (CHEMBL1908580)
Kd
>10000±n/a nM
Citation
 Davis, MIHunt, JPHerrgard, SCiceri, PWodicka, LMPallares, GHocker, MTreiber, DKZarrinkar, PP Comprehensive analysis of kinase inhibitor selectivity. Nat Biotechnol 29:1046-51 (2011)  
Target
Name:
Protein kinase C iota type
Synonyms:
Atypical protein kinase C-lambda/iota KPCI_HUMAN PRKCI Protein kinase C iota Protein kinase C iota type aPKC-lambda/iota | nPKC-iota
Type:
Enzyme
Mol. Mass.:
68251.56
Organism:
Homo sapiens (Human)
Description:
P41743
Residue:
596
  
Inhibitor
Name:
BDBM13534
Synonyms:
CHEMBL572878 N-[4-[[4-(4-methylpiperazino)-6-[(5-methyl-1H-pyrazol-3-yl)amino]pyrimidin-2-yl]thio]phenyl]cyclopropanecarboxamide VX680 | cyclopropane carboxylic acid {4-[4-(4-methyl-piperazin-1-yl)-6-(5-methyl-2H-pyrazol-3-ylamino)-pyrimidin-2ylsulphanyl]-phenyl}-amide
Type:
Small organic molecule
Emp. Form.:
C23H28N8OS
Mol. Mass.:
464.586
SMILES:
CN1CCN(CC1)c1cc(Nc2cc(C)n[nH]2)nc(Sc2ccc(NC(=O)C3CC3)cc2)n1
: