Target
Cyclin-dependent kinase 19
Ligand
BDBM25919
Substrate
Meas. Tech.
ChEMBL_774574 (CHEMBL1908791)
Kd
>10000±n/a nM
Citation
 Davis, MIHunt, JPHerrgard, SCiceri, PWodicka, LMPallares, GHocker, MTreiber, DKZarrinkar, PP Comprehensive analysis of kinase inhibitor selectivity. Nat Biotechnol 29:1046-51 (2011)  
Target
Name:
Cyclin-dependent kinase 19
Synonyms:
CDC2-related protein kinase 6 CDK11 CDK19_HUMAN Cell division protein kinase 19 Death-preventing kinase | KIAA1028
Type:
Serine/Threonine protein kinase
Mol. Mass.:
56816.68
Organism:
Homo sapiens (Human)
Description:
Q9BWU1
Residue:
502
  
Inhibitor
Name:
BDBM25919
Synonyms:
BMS-345541 CHEMBL471496 | N-(2-aminoethyl)-3,12-dimethyl-2,5,8-triazatricyclo[7.4.0.0^{2,6}]trideca-1(13),3,5,7,9,11-hexaen-7-amine
Type:
Small organic molecule
Emp. Form.:
C14H17N5
Mol. Mass.:
255.3183
SMILES:
Cc1cnc2c(NCCN)nc3ccc(C)cc3n12
: