Target
Mitogen-activated protein kinase 7
Ligand
BDBM31095
Substrate
Meas. Tech.
ChEMBL_774368 (CHEMBL1908585)
Kd
>10000±n/a nM
Citation
 Davis, MIHunt, JPHerrgard, SCiceri, PWodicka, LMPallares, GHocker, MTreiber, DKZarrinkar, PP Comprehensive analysis of kinase inhibitor selectivity. Nat Biotechnol 29:1046-51 (2011)  
Target
Name:
Mitogen-activated protein kinase 7
Synonyms:
BMK1 ERK5 MAPK7 PRKM7
Type:
Protein
Mol. Mass.:
88377.36
Organism:
Homo sapiens (Human)
Description:
Q13164
Residue:
816
  
Inhibitor
Name:
BDBM31095
Synonyms:
5-[(Z)-(5-fluoranyl-2-oxidanylidene-1H-indol-3-ylidene)methyl]-2,4-dimethyl-N-[(2S)-3-morpholin-4-yl-2-oxidanyl-propyl]-1H-pyrrole-3-carboxamide 5-[(Z)-(5-fluoro-2-oxo-1H-indol-3-ylidene)methyl]-N-[(2S)-2-hydroxy-3-(4-morpholinyl)propyl]-2,4-dimethyl-1H-pyrrole-3-carboxamide SU-14813 | cid_10138259
Type:
Small organic molecule
Emp. Form.:
C23H27FN4O4
Mol. Mass.:
442.4833
SMILES:
Cc1[nH]c(\C=C2/C(=O)Nc3ccc(F)cc23)c(C)c1C(=O)NC[C@H](O)CN1CCOCC1
: