Target
Serine/threonine-protein kinase Nek11
Ligand
BDBM13336
Substrate
Meas. Tech.
ChEMBL_774205 (CHEMBL1908422)
Kd
>10000±n/a nM
Citation
 Davis, MIHunt, JPHerrgard, SCiceri, PWodicka, LMPallares, GHocker, MTreiber, DKZarrinkar, PP Comprehensive analysis of kinase inhibitor selectivity. Nat Biotechnol 29:1046-51 (2011)  
Target
Name:
Serine/threonine-protein kinase Nek11
Synonyms:
NEK11 Never in mitosis A-related kinase 11 | NimA-related protein kinase 11
Type:
PROTEIN
Mol. Mass.:
74163.79
Organism:
Homo sapiens (Human)
Description:
ChEMBL_774205
Residue:
645
  
Inhibitor
Name:
BDBM13336
Synonyms:
4-[4-(4-fluorophenyl)-2-(4-methanesulfinylphenyl)-1H-imidazol-5-yl]pyridine 4-{4-(4-fluorophenyl)-2-[4-(methylsulfinyl)phenyl]-1H-imidazol-5-yl}pyridine SB-203580 cid_176155
Type:
Small organic molecule
Emp. Form.:
C21H16FN3OS
Mol. Mass.:
377.435
SMILES:
CS(=O)c1ccc(cc1)-c1nc(c([nH]1)-c1ccc(F)cc1)-c1ccncc1
: