Target
Cyclin-dependent kinase 13
Ligand
BDBM50309910
Substrate
Meas. Tech.
ChEMBL_774241 (CHEMBL1908458)
Kd
>10000±n/a nM
Citation
 Davis, MIHunt, JPHerrgard, SCiceri, PWodicka, LMPallares, GHocker, MTreiber, DKZarrinkar, PP Comprehensive analysis of kinase inhibitor selectivity. Nat Biotechnol 29:1046-51 (2011)  
Target
Name:
Cyclin-dependent kinase 13
Synonyms:
CDC2-related protein kinase 5 CDC2L5 CDK13_HUMAN Cell division cycle 2-like protein kinase 5 Cholinesterase-related cell division controller hCDK13
Type:
PROTEIN
Mol. Mass.:
165002.38
Organism:
Homo sapiens (Human)
Description:
ChEMBL_774241
Residue:
1512
  
Inhibitor
Name:
BDBM50309910
Synonyms:
CHEMBL608154 N-(6-chloro-7-methoxy-9H-pyrido[3,4-b]indol-8-yl)-2-methylnicotinamide
Type:
Small organic molecule
Emp. Form.:
C19H15ClN4O2
Mol. Mass.:
366.801
SMILES:
COc1c(Cl)cc2c3ccncc3[nH]c2c1NC(=O)c1cccnc1C
: