Target
Dual specificity tyrosine-phosphorylation-regulated kinase 1A
Ligand
BDBM50322823
Substrate
Meas. Tech.
ChEMBL_774192 (CHEMBL1908409)
Kd
970±n/a nM
Citation
 Davis, MIHunt, JPHerrgard, SCiceri, PWodicka, LMPallares, GHocker, MTreiber, DKZarrinkar, PP Comprehensive analysis of kinase inhibitor selectivity. Nat Biotechnol 29:1046-51 (2011)  
Target
Name:
Dual specificity tyrosine-phosphorylation-regulated kinase 1A
Synonyms:
DYR1A_HUMAN DYRK1A Dual specificity YAK1-related kinase 1A (Dyrk1A) Dual-specificity tyrosine-phosphorylation regulated kinase 1A HP86 MNBH
Type:
Enzyme
Mol. Mass.:
85616.61
Organism:
Homo sapiens (Human)
Description:
Q13627
Residue:
763
  
Inhibitor
Name:
BDBM50322823
Synonyms:
(S)-N-(4-(3-chloro-4-fluorophenylamino)-7-(tetrahydrofuran-3-yloxy)quinazolin-6-yl)-4-(dimethylamino)but-2-enamide CHEMBL1173655 US10196365, Afatinib US11896597, Compound Afatinib US9890168, Compound BIBW2992 | WO2022090481, Example afatinib
Type:
Small organic molecule
Emp. Form.:
C24H25ClFN5O3
Mol. Mass.:
485.938
SMILES:
CN(C)C\C=C\C(=O)Nc1cc2c(Nc3ccc(F)c(Cl)c3)ncnc2cc1O[C@H]1CCOC1
: