Target
Serine/threonine-protein kinase OSR1
Ligand
BDBM36409
Substrate
Meas. Tech.
ChEMBL_774457 (CHEMBL1908674)
Kd
>10000±n/a nM
Citation
 Davis, MIHunt, JPHerrgard, SCiceri, PWodicka, LMPallares, GHocker, MTreiber, DKZarrinkar, PP Comprehensive analysis of kinase inhibitor selectivity. Nat Biotechnol 29:1046-51 (2011)  
Target
Name:
Serine/threonine-protein kinase OSR1
Synonyms:
KIAA1101 OXSR1 Oxidative stress-responsive 1 protein
Type:
PROTEIN
Mol. Mass.:
58020.49
Organism:
Homo sapiens (Human)
Description:
ChEMBL_655500
Residue:
527
  
Inhibitor
Name:
BDBM36409
Synonyms:
2-(4-amino-1-isopropyl-1H-pyrazolo[3,4-d]pyrimidin-3-yl)-1H-indol-5-ol, PP242 US10172858, Table 2.1 | US9828378, # 1
Type:
Small organic molecule
Emp. Form.:
C16H16N6O
Mol. Mass.:
308.3378
SMILES:
CC(C)n1nc(-c2cc3cc(O)ccc3[nH]2)c2c(N)ncnc12
: