Target
Mitogen-activated protein kinase kinase kinase 3
Ligand
BDBM17055
Substrate
Meas. Tech.
ChEMBL_774345 (CHEMBL1908562)
Kd
170±n/a nM
Citation
 Davis, MIHunt, JPHerrgard, SCiceri, PWodicka, LMPallares, GHocker, MTreiber, DKZarrinkar, PP Comprehensive analysis of kinase inhibitor selectivity. Nat Biotechnol 29:1046-51 (2011)  
Target
Name:
Mitogen-activated protein kinase kinase kinase 3
Synonyms:
M3K3_HUMAN MAPKKK3 Mitogen-activated protein kinase kinase kinase 3 | mitogen-activated protein kinase kinase kinase 3 isoform 1
Type:
PROTEIN
Mol. Mass.:
70916.05
Organism:
Homo sapiens (Human)
Description:
ChEMBL_774345
Residue:
626
  
Inhibitor
Name:
BDBM17055
Synonyms:
(18S)-18-[(dimethylamino)methyl]-17-oxa-4,14,21-triazahexacyclo[19.6.1.1^{7,14}.0^{2,6}.0^{8,13}.0^{22,27}]nonacosa-1(28),2(6),7(29),8(13),9,11,22(27),23,25-nonaene-3,5-dione K00587a LY-333531 Ruboxistaurin | cid_153999
Type:
Small organic molecule
Emp. Form.:
C28H28N4O3
Mol. Mass.:
468.5469
SMILES:
CN(C)C[C@@H]1CCn2cc(C3=C(C(=O)NC3=O)c3cn(CCO1)c1ccccc31)c1ccccc21
: