Target
Phosphorylase b kinase gamma catalytic chain, skeletal muscle/heart isoform
Ligand
BDBM50322823
Substrate
Meas. Tech.
ChEMBL_774515 (CHEMBL1908732)
Kd
1300±n/a nM
Citation
 Davis, MIHunt, JPHerrgard, SCiceri, PWodicka, LMPallares, GHocker, MTreiber, DKZarrinkar, PP Comprehensive analysis of kinase inhibitor selectivity. Nat Biotechnol 29:1046-51 (2011)  
Target
Name:
Phosphorylase b kinase gamma catalytic chain, skeletal muscle/heart isoform
Synonyms:
PHKG PHKG1_HUMAN Phosphorylase kinase Phosphorylase kinase subunit gamma 1
Type:
PROTEIN
Mol. Mass.:
45025.22
Organism:
Homo sapiens (Human)
Description:
ChEMBL_774515
Residue:
387
  
Inhibitor
Name:
BDBM50322823
Synonyms:
(S)-N-(4-(3-chloro-4-fluorophenylamino)-7-(tetrahydrofuran-3-yloxy)quinazolin-6-yl)-4-(dimethylamino)but-2-enamide CHEMBL1173655 US10196365, Afatinib US11896597, Compound Afatinib US9890168, Compound BIBW2992 | WO2022090481, Example afatinib
Type:
Small organic molecule
Emp. Form.:
C24H25ClFN5O3
Mol. Mass.:
485.938
SMILES:
CN(C)C\C=C\C(=O)Nc1cc2c(Nc3ccc(F)c(Cl)c3)ncnc2cc1O[C@H]1CCOC1
: