Target
Urease
Ligand
BDBM50356195
Substrate
Meas. Tech.
ChEMBL_774847 (CHEMBL1913189)
Ki
122±n/a nM
Citation
 Aslam, MAMahmood, SUShahid, MSaeed, AIqbal, J Synthesis, biological assay in vitro and molecular docking studies of new Schiff base derivatives as potential urease inhibitors. Eur J Med Chem 46:5473-9 (2011)  
Target
Name:
Urease
Synonyms:
UREA_CANEN | Urea amidohydrolase
Type:
Enzyme
Mol. Mass.:
90746.20
Organism:
Canavalia ensiformis (Jack bean) (Horse bean)
Description:
P07374
Residue:
840
  
Inhibitor
Name:
BDBM50356195
Synonyms:
CHEMBL241902
Type:
Small organic molecule
Emp. Form.:
C10H14N4S
Mol. Mass.:
222.31
SMILES:
CN(C)c1ccc(C=NNC(N)=S)cc1
: