Target
Urease
Ligand
BDBM50356198
Substrate
Meas. Tech.
ChEMBL_774847 (CHEMBL1913189)
Ki
191±n/a nM
Citation
 Aslam, MAMahmood, SUShahid, MSaeed, AIqbal, J Synthesis, biological assay in vitro and molecular docking studies of new Schiff base derivatives as potential urease inhibitors. Eur J Med Chem 46:5473-9 (2011)  
Target
Name:
Urease
Synonyms:
UREA_CANEN | Urea amidohydrolase
Type:
Enzyme
Mol. Mass.:
90746.20
Organism:
Canavalia ensiformis (Jack bean) (Horse bean)
Description:
P07374
Residue:
840
  
Inhibitor
Name:
BDBM50356198
Synonyms:
CHEMBL1910222
Type:
Small organic molecule
Emp. Form.:
C16H17N3O2S
Mol. Mass.:
315.39
SMILES:
COc1ccc(C=NNC(N)=S)cc1OCc1ccccc1
: