Target
Cannabinoid receptor 1
Ligand
BDBM50356554
Substrate
Meas. Tech.
ChEMBL_776030 (CHEMBL1912500)
Ki
48±n/a nM
Citation
 Piscitelli, FLigresti, ALa Regina, GGatti, VBrizzi, APasquini, SAllarà, MCarai, MANovellino, EColombo, GDi Marzo, VCorelli, FSilvestri, R 1-Aryl-5-(1H-pyrrol-1-yl)-1H-pyrazole-3-carboxamide: an effective scaffold for the design of either CB1 or CB2 receptor ligands. Eur J Med Chem 46:5641-53 (2011)  
Target
Name:
Cannabinoid receptor 1
Synonyms:
CANN6 CB-R CNR CNR1_HUMAN Cannabinoid receptor Cannabinoid receptor 1 (brain)
Type:
G Protein-Coupled Receptor (GPCR)
Mol. Mass.:
52868.96
Organism:
Homo sapiens (Human)
Description:
P21554
Residue:
472
  
Inhibitor
Name:
BDBM50356554
Synonyms:
CHEMBL1909957
Type:
Small organic molecule
Emp. Form.:
C24H28Cl2N4O
Mol. Mass.:
459.411
SMILES:
CCc1c(nn(c1-n1c(C)ccc1C)-c1ccc(Cl)c(Cl)c1)C(=O)NC1CCCCC1
: