Target
Acetylcholinesterase
Ligand
BDBM50356916
Substrate
Meas. Tech.
ChEMBL_787787 (CHEMBL1918466)
IC50
18350±n/a nM
Citation
 Lee, IAhn, BChoi, JHattori, MMin, BBae, K Selective cholinesterase inhibition by lanostane triterpenes from fruiting bodies of Ganoderma lucidum. Bioorg Med Chem Lett 21:6603-7 (2011)  
Target
Name:
Acetylcholinesterase
Synonyms:
ACES_HUMAN Acetylcholinesterase (AChE) | Acetylcholinesterase (human AChE)
Type:
Enzyme
Mol. Mass.:
67792.70
Organism:
Homo sapiens (Human)
Description:
P22303
Residue:
614
  
Inhibitor
Name:
BDBM50356916
Synonyms:
CHEMBL465514
Type:
Small organic molecule
Emp. Form.:
C30H40O7
Mol. Mass.:
512.6344
SMILES:
C[C@H](CC(=O)C[C@@H](C)C(O)=O)[C@H]1CC(=O)[C@@]2(C)C3=C(C(=O)C[C@]12C)[C@@]1(C)CCC(=O)C(C)(C)[C@@H]1CC3=O
: