Target
Acetylcholinesterase
Ligand
BDBM50356917
Substrate
Meas. Tech.
ChEMBL_787787 (CHEMBL1918466)
IC50
22970±n/a nM
Citation
 Lee, IAhn, BChoi, JHattori, MMin, BBae, K Selective cholinesterase inhibition by lanostane triterpenes from fruiting bodies of Ganoderma lucidum. Bioorg Med Chem Lett 21:6603-7 (2011)  
Target
Name:
Acetylcholinesterase
Synonyms:
ACES_HUMAN Acetylcholinesterase (AChE) | Acetylcholinesterase (human AChE)
Type:
Enzyme
Mol. Mass.:
67792.70
Organism:
Homo sapiens (Human)
Description:
P22303
Residue:
614
  
Inhibitor
Name:
BDBM50356917
Synonyms:
GANOLUCIDIC ACID A
Type:
Small organic molecule
Emp. Form.:
C30H44O6
Mol. Mass.:
500.6668
SMILES:
C[C@H](CC(=O)CC(C)C(O)=O)[C@H]1C[C@H](O)[C@@]2(C)C3=C(C(=O)C[C@]12C)[C@@]1(C)CCC(=O)C(C)(C)[C@@H]1CC3
: