Target
Acetylcholinesterase
Ligand
BDBM50356918
Substrate
Meas. Tech.
ChEMBL_787787 (CHEMBL1918466)
IC50
26780±n/a nM
Citation
 Lee, IAhn, BChoi, JHattori, MMin, BBae, K Selective cholinesterase inhibition by lanostane triterpenes from fruiting bodies of Ganoderma lucidum. Bioorg Med Chem Lett 21:6603-7 (2011)  
Target
Name:
Acetylcholinesterase
Synonyms:
ACES_HUMAN Acetylcholinesterase (AChE) | Acetylcholinesterase (human AChE)
Type:
Enzyme
Mol. Mass.:
67792.70
Organism:
Homo sapiens (Human)
Description:
P22303
Residue:
614
  
Inhibitor
Name:
BDBM50356918
Synonyms:
GANODEROL B
Type:
Small organic molecule
Emp. Form.:
C30H48O2
Mol. Mass.:
440.7009
SMILES:
C[C@H](CC\C=C(/C)CO)[C@H]1CC[C@@]2(C)C3=CC[C@H]4C(C)(C)[C@@H](O)CC[C@]4(C)C3=CC[C@]12C
: