Target
Acetylcholinesterase
Ligand
BDBM50356920
Substrate
Meas. Tech.
ChEMBL_787787 (CHEMBL1918466)
IC50
21840±n/a nM
Citation
 Lee, IAhn, BChoi, JHattori, MMin, BBae, K Selective cholinesterase inhibition by lanostane triterpenes from fruiting bodies of Ganoderma lucidum. Bioorg Med Chem Lett 21:6603-7 (2011)  
Target
Name:
Acetylcholinesterase
Synonyms:
ACES_HUMAN Acetylcholinesterase (AChE) | Acetylcholinesterase (human AChE)
Type:
Enzyme
Mol. Mass.:
67792.70
Organism:
Homo sapiens (Human)
Description:
P22303
Residue:
614
  
Inhibitor
Name:
BDBM50356920
Synonyms:
CHEMBL1915761
Type:
Small organic molecule
Emp. Form.:
C30H46O3
Mol. Mass.:
454.6844
SMILES:
[#6]-[#6@H](-[#6]-[#6]\[#6]=[#6](/[#6]-[#8])-[#6]-[#8])-[#6@H]1-[#6]-[#6][C@@]2([#6])[#6]-3=[#6]-[#6]-[#6@H]4C([#6])([#6])[#6](=O)-[#6]-[#6][C@]4([#6])[#6]-3=[#6]-[#6][C@]12[#6]
: