Target
Acetylcholinesterase
Ligand
BDBM50356925
Substrate
Meas. Tech.
ChEMBL_787787 (CHEMBL1918466)
IC50
25910±n/a nM
Citation
 Lee, IAhn, BChoi, JHattori, MMin, BBae, K Selective cholinesterase inhibition by lanostane triterpenes from fruiting bodies of Ganoderma lucidum. Bioorg Med Chem Lett 21:6603-7 (2011)  
Target
Name:
Acetylcholinesterase
Synonyms:
ACES_HUMAN Acetylcholinesterase (AChE) | Acetylcholinesterase (human AChE)
Type:
Enzyme
Mol. Mass.:
67792.70
Organism:
Homo sapiens (Human)
Description:
P22303
Residue:
614
  
Inhibitor
Name:
BDBM50356925
Synonyms:
CHEMBL465487
Type:
Small organic molecule
Emp. Form.:
C27H40O6
Mol. Mass.:
460.6029
SMILES:
C[C@H](CCC(O)=O)[C@H]1CC(=O)[C@@]2(C)C3=C(C(=O)C[C@]12C)[C@@]1(C)CC[C@H](O)C(C)(C)[C@@H]1C[C@@H]3O
: