Target
Cholinesterase
Ligand
BDBM50356912
Substrate
Meas. Tech.
ChEMBL_787788 (CHEMBL1918467)
IC50
>200000±n/a nM
Citation
 Lee, IAhn, BChoi, JHattori, MMin, BBae, K Selective cholinesterase inhibition by lanostane triterpenes from fruiting bodies of Ganoderma lucidum. Bioorg Med Chem Lett 21:6603-7 (2011)  
Target
Name:
Cholinesterase
Synonyms:
Acylcholine acylhydrolase Butyrylcholine esterase (BChE) Butyrylcholinesterase (BuChE) CHLE_HUMAN Cholinesterases Pseudocholinesterase
Type:
Homotetramer
Mol. Mass.:
68422.27
Organism:
Homo sapiens (Human)
Description:
P06276
Residue:
602
  
Inhibitor
Name:
BDBM50356912
Synonyms:
CHEMBL1915758
Type:
Small organic molecule
Emp. Form.:
C34H50O7
Mol. Mass.:
570.7566
SMILES:
COC(=O)[C@H](C)CC(=O)C[C@@H](C)[C@H]1C[C@@H]2OC(C)(C)O[C@H]3C[C@H]4C(C)(C)C(=O)CC[C@]4(C)C4=C3[C@@]2(C)[C@]1(C)CC4=O
: