Target
Cholinesterase
Ligand
BDBM50356915
Substrate
Meas. Tech.
ChEMBL_787788 (CHEMBL1918467)
IC50
>200000±n/a nM
Citation
 Lee, IAhn, BChoi, JHattori, MMin, BBae, K Selective cholinesterase inhibition by lanostane triterpenes from fruiting bodies of Ganoderma lucidum. Bioorg Med Chem Lett 21:6603-7 (2011)  
Target
Name:
Cholinesterase
Synonyms:
Acylcholine acylhydrolase Butyrylcholine esterase (BChE) Butyrylcholinesterase (BuChE) CHLE_HUMAN Cholinesterases Pseudocholinesterase
Type:
Homotetramer
Mol. Mass.:
68422.27
Organism:
Homo sapiens (Human)
Description:
P06276
Residue:
602
  
Inhibitor
Name:
BDBM50356915
Synonyms:
GANODERIC ACID B
Type:
Small organic molecule
Emp. Form.:
C30H44O7
Mol. Mass.:
516.6662
SMILES:
C[C@H](CC(=O)CC(C)C(O)=O)[C@H]1CC(=O)[C@@]2(C)C3=C(C(=O)C[C@]12C)[C@@]1(C)CC[C@H](O)C(C)(C)[C@@H]1C[C@@H]3O
: