Target
Cholinesterase
Ligand
BDBM50356920
Substrate
Meas. Tech.
ChEMBL_787788 (CHEMBL1918467)
IC50
>200000±n/a nM
Citation
 Lee, IAhn, BChoi, JHattori, MMin, BBae, K Selective cholinesterase inhibition by lanostane triterpenes from fruiting bodies of Ganoderma lucidum. Bioorg Med Chem Lett 21:6603-7 (2011)  
Target
Name:
Cholinesterase
Synonyms:
Acylcholine acylhydrolase Butyrylcholine esterase (BChE) Butyrylcholinesterase (BuChE) CHLE_HUMAN Cholinesterases Pseudocholinesterase
Type:
Homotetramer
Mol. Mass.:
68422.27
Organism:
Homo sapiens (Human)
Description:
P06276
Residue:
602
  
Inhibitor
Name:
BDBM50356920
Synonyms:
CHEMBL1915761
Type:
Small organic molecule
Emp. Form.:
C30H46O3
Mol. Mass.:
454.6844
SMILES:
[#6]-[#6@H](-[#6]-[#6]\[#6]=[#6](/[#6]-[#8])-[#6]-[#8])-[#6@H]1-[#6]-[#6][C@@]2([#6])[#6]-3=[#6]-[#6]-[#6@H]4C([#6])([#6])[#6](=O)-[#6]-[#6][C@]4([#6])[#6]-3=[#6]-[#6][C@]12[#6]
: