Target
Cholinesterase
Ligand
BDBM50356927
Substrate
Meas. Tech.
ChEMBL_787788 (CHEMBL1918467)
IC50
>200000±n/a nM
Citation
 Lee, IAhn, BChoi, JHattori, MMin, BBae, K Selective cholinesterase inhibition by lanostane triterpenes from fruiting bodies of Ganoderma lucidum. Bioorg Med Chem Lett 21:6603-7 (2011)  
Target
Name:
Cholinesterase
Synonyms:
Acylcholine acylhydrolase Butyrylcholine esterase (BChE) Butyrylcholinesterase (BuChE) CHLE_HUMAN Cholinesterases Pseudocholinesterase
Type:
Homotetramer
Mol. Mass.:
68422.27
Organism:
Homo sapiens (Human)
Description:
P06276
Residue:
602
  
Inhibitor
Name:
BDBM50356927
Synonyms:
CHEMBL512830
Type:
Small organic molecule
Emp. Form.:
C30H42O8
Mol. Mass.:
530.6497
SMILES:
COC(=O)CC[C@@H](C)[C@H]1CC(=O)[C@@]2(C)C3=C(C(=O)[C@@H](OC(C)=O)[C@]12C)[C@@]1(C)CC[C@H](O)C(C)(C)[C@@H]1CC3=O
: