Target
Cholinesterase
Ligand
BDBM50203126
Substrate
Meas. Tech.
ChEMBL_787788 (CHEMBL1918467)
IC50
18970±n/a nM
Citation
 Lee, IAhn, BChoi, JHattori, MMin, BBae, K Selective cholinesterase inhibition by lanostane triterpenes from fruiting bodies of Ganoderma lucidum. Bioorg Med Chem Lett 21:6603-7 (2011)  
Target
Name:
Cholinesterase
Synonyms:
Acylcholine acylhydrolase Butyrylcholine esterase (BChE) Butyrylcholinesterase (BuChE) CHLE_HUMAN Cholinesterases Pseudocholinesterase
Type:
Homotetramer
Mol. Mass.:
68422.27
Organism:
Homo sapiens (Human)
Description:
P06276
Residue:
602
  
Inhibitor
Name:
BDBM50203126
Synonyms:
3,4-dimethoxy-6,7-dihydro-[1,3]dioxolo[4,5-g]pyrido[2,1-a]isoquinolin-5-ylium 9,10-Dimethoxy-5,6-dihydro-[1,3]dioxolo[4,5-g]isoquino[3,2-a]isoquinolin-7-ylium chloride BERBERINE CHEMBL12089 cid_12456
Type:
Small organic molecule
Emp. Form.:
C20H18NO4
Mol. Mass.:
336.3607
SMILES:
COc1ccc2cc3-c4cc5OCOc5cc4CC[n+]3cc2c1OC
: