Target
Cytochrome P450 1A2
Ligand
BDBM50356966
Substrate
Meas. Tech.
ChEMBL_788059 (CHEMBL1919038)
IC50
>25000±n/a nM
Citation
 Lebois, EPDigby, GJSheffler, DJMelancon, BJTarr, JCCho, HPMiller, NRMorrison, RBridges, TMXiang, ZScott Daniels, JWood, MRConn, PJLindsley, CW Development of a highly selective, orally bioavailable and CNS penetrant M1 agonist derived from the MLPCN probe ML071. Bioorg Med Chem Lett 21:6451-5 (2011)  
Target
Name:
Cytochrome P450 1A2
Synonyms:
CP1A2_HUMAN CYPIA2 Cytochrome P(3)450 Cytochrome P450 1A2 (CYP1A2) Cytochrome P450-P3
Type:
Enzyme
Mol. Mass.:
58423.38
Organism:
Homo sapiens (Human)
Description:
P05177
Residue:
516
  
Inhibitor
Name:
BDBM50356966
Synonyms:
CHEMBL1916224
Type:
Small organic molecule
Emp. Form.:
C21H31N3O3
Mol. Mass.:
373.4891
SMILES:
CCOC(=O)N1CCC(CC1)N1CCC[C@H](C1)NC(=O)c1ccccc1C
: