Target
Tyrosine-protein phosphatase non-receptor type 7
Ligand
BDBM50357392
Substrate
Meas. Tech.
ChEMBL_787850 (CHEMBL1918616)
IC50
>100000±n/a nM
Citation
 Liu, DKong, GChen, QCWang, GLi, JXu, Ylin, TTian, YZhang, XYao, XFeng, GLu, ZChen, H Fatty acids as natural specific inhibitors of the proto-oncogenic protein Shp2. Bioorg Med Chem Lett 21:6833-7 (2011)  
Target
Name:
Tyrosine-protein phosphatase non-receptor type 7
Synonyms:
He-PTP Hematopoietic protein-tyrosine phosphatase (HEPTP) PTPN7 Tyrosine-protein phosphatase non-receptor type 7 | Tyrosine-protein phosphatase non-receptor type 7 (HEPTP)
Type:
Protein
Mol. Mass.:
40530.79
Organism:
Homo sapiens (Human)
Description:
P35236
Residue:
360
  
Inhibitor
Name:
BDBM50357392
Synonyms:
CHEMBL1595008
Type:
Small organic molecule
Emp. Form.:
C13H26O4
Mol. Mass.:
246.3431
SMILES:
CCCCCCCCCC(=O)OCC(O)CO
: