Target
Induced myeloid leukemia cell differentiation protein Mcl-1 homolog
Ligand
BDBM50357756
Substrate
Meas. Tech.
ChEMBL_785939 (CHEMBL1921249)
Ki
2000±n/a nM
Citation
 Goreshnik, IBrock, AMMaly, DJ Biochemical and pharmacological profiling of the pro-survival protein Bcl-xL. Bioorg Med Chem Lett 21:4951-5 (2011)  
Target
Name:
Induced myeloid leukemia cell differentiation protein Mcl-1 homolog
Synonyms:
Bcl-2-related protein EAT/mcl1 Mcl-1 | Mcl1
Type:
Developmental protein
Mol. Mass.:
35215.08
Organism:
Mus musculus (Mouse)
Description:
Residue:
331
  
Inhibitor
Name:
BDBM50357756
Synonyms:
CHEMBL1916194
Type:
Small organic molecule
Emp. Form.:
C40H47F3N6O5S2
Mol. Mass.:
812.964
SMILES:
CC(C)[C@@H]1CN(Cc2ccccc2C(F)(F)F)CCN1c1ccc(cc1)C(=O)NS(=O)(=O)c1ccc(N[C@H](CCN(C)C)CSc2ccccc2)c(c1)[N+]([O-])=O
: