Target
Ephrin type-B receptor 1
Ligand
BDBM50357884
Substrate
Meas. Tech.
ChEMBL_786756 (CHEMBL1919597)
IC50
>10000±n/a nM
Citation
 Lumeras, WVidal, LVidal, BBalagué, COrellana, AMaldonado, MDomínguez, MSegarra, VCaturla, F 1,7-Naphthyridine 1-oxides as novel potent and selective inhibitors of p38 mitogen activated protein kinase. J Med Chem 54:7899-910 (2011)  
Target
Name:
Ephrin type-B receptor 1
Synonyms:
ELK EPHB1 EPHT2 Ephrin type-B receptor 1 NET
Type:
Enzyme Catalytic Domain
Mol. Mass.:
109882.53
Organism:
Homo sapiens (Human)
Description:
EPH receptor B1 EPHB1 HUMAN::P54762
Residue:
984
  
Inhibitor
Name:
BDBM50357884
Synonyms:
CHEMBL1916359
Type:
Small organic molecule
Emp. Form.:
C20H10Cl3FN2O
Mol. Mass.:
419.664
SMILES:
[O-][n+]1ccc2c(ccnc2c1-c1c(Cl)cccc1Cl)-c1ccc(F)cc1Cl
: