Target
5-hydroxytryptamine receptor 1A
Ligand
BDBM50357992
Substrate
Meas. Tech.
ChEMBL_787169 (CHEMBL1918839)
Ki
325±n/a nM
Citation
 Zajdel, PMarciniec, KMaslankiewicz, APaluchowska, MHSatala, GPartyka, AJastrzebska-Wiesek, MWróbel, DWesolowska, ADuszynska, BBojarski, AJPawlowski, M Arene- and quinoline-sulfonamides as novel 5-HT7 receptor ligands. Bioorg Med Chem 19:6750-9 (2011)  
Target
Name:
5-hydroxytryptamine receptor 1A
Synonyms:
5-HT-1A 5-HT1A 5-hydroxytryptamine receptor 1A (5HT1A) 5ht1a Htr1a Serotonin 1a (5-HT1a) receptor/Adrenergic receptor alpha-1 | Serotonin receptor 1A
Type:
G Protein-Coupled Receptor (GPCR)
Mol. Mass.:
46445.29
Organism:
Rattus norvegicus (rat)
Description:
Binding assays were performed using rat hippocampal membranes.
Residue:
422
  
Inhibitor
Name:
BDBM50357992
Synonyms:
CHEMBL1917358
Type:
Small organic molecule
Emp. Form.:
C24H35N3O2S
Mol. Mass.:
429.619
SMILES:
CCN(CCCCN1CCC2CCCCC2C1)S(=O)(=O)c1cnc2ccccc2c1
: