Target
Cyclin-H/Cyclin-dependent kinase 7
Ligand
BDBM50358219
Substrate
Meas. Tech.
ChEMBL_790668 (CHEMBL1926121)
IC50
4200±n/a nM
Citation
 Wilson, SCAtrash, BBarlow, CEccles, SFischer, PMHayes, AKelland, LJackson, WJarman, MMirza, AMoreno, JNutley, BPRaynaud, FISheldrake, PWalton, MWestwood, RWhittaker, SWorkman, PMcDonald, E Design, synthesis and biological evaluation of 6-pyridylmethylaminopurines as CDK inhibitors. Bioorg Med Chem 19:6949-65 (2011)  
Target
Name:
Cyclin-H/Cyclin-dependent kinase 7
Synonyms:
CDK-activating kinase assembly factor MAT1/Cyclin H/Cyclin-dependent kinase 7 CDK7/H Cyclin-Dependent Kinase 7 (CDK7) Cyclin-dependent kinase 7/cyclin H
Type:
Protein Complex
Mol. Mass.:
Description:
Components:
This complex has 2 components.
Component 1
Name:
Cyclin-H
Synonyms:
CCNH Cyclin H p34 | p37
Type:
Enzyme Subunit
Mol. Mass.:
37646.05
Organism:
Homo sapiens (Human)
Description:
Residue:
323
  
Component 2
Name:
Cyclin-dependent kinase 7
Synonyms:
39 kDa protein kinase CAK1 CDK-activating kinase 1 (CAK) CDK7_HUMAN Cell division protein kinase 7 Cyclin-dependent kinase 7 (CDK7/cyclin H) P39 Mo15 TFIIH basal transcription factor complex kinase subunit
Type:
Enzyme Subunit
Mol. Mass.:
39047.01
Organism:
Homo sapiens (Human)
Description:
Residue:
346
  
Inhibitor
Name:
BDBM50358219
Synonyms:
CHEMBL1922118
Type:
Small organic molecule
Emp. Form.:
C20H29N7O
Mol. Mass.:
383.4906
SMILES:
CC[C@@H](Nc1nc(NCc2ccccn2)c2ncn(C(C)C)c2n1)C(C)(C)O
: