Target
Cannabinoid receptor 1
Ligand
BDBM50358959
Substrate
Meas. Tech.
ChEMBL_790914 (CHEMBL1926462)
Ki
2940±n/a nM
Citation
 Brizzi, ACascio, MGFrosini, MLigresti, AAiello, FBiotti, IBrizzi, VPertwee, RGCorelli, FDi Marzo, V Resorcinol-sn-glycerol derivatives: novel 2-arachidonoylglycerol mimetics endowed with high affinity and selectivity for cannabinoid type 1 receptor. J Med Chem 54:8278-88 (2011)  
Target
Name:
Cannabinoid receptor 1
Synonyms:
CANN6 CB-R CNR CNR1_HUMAN Cannabinoid receptor Cannabinoid receptor 1 (brain)
Type:
G Protein-Coupled Receptor (GPCR)
Mol. Mass.:
52868.96
Organism:
Homo sapiens (Human)
Description:
P21554
Residue:
472
  
Inhibitor
Name:
BDBM50358959
Synonyms:
CHEMBL1923773
Type:
Small organic molecule
Emp. Form.:
C28H50O5
Mol. Mass.:
466.6936
SMILES:
CCCCCCC(C)(C)c1cc(O)cc(OCCCCCCCCCCOC(CO)CO)c1
: