Target
Cannabinoid receptor 2
Ligand
BDBM50358946
Substrate
Meas. Tech.
ChEMBL_790915 (CHEMBL1926463)
Ki
1800±n/a nM
Citation
 Brizzi, ACascio, MGFrosini, MLigresti, AAiello, FBiotti, IBrizzi, VPertwee, RGCorelli, FDi Marzo, V Resorcinol-sn-glycerol derivatives: novel 2-arachidonoylglycerol mimetics endowed with high affinity and selectivity for cannabinoid type 1 receptor. J Med Chem 54:8278-88 (2011)  
Target
Name:
Cannabinoid receptor 2
Synonyms:
CANNABINOID CB2 CB2 CB2B CNR2_HUMAN Cannabinoid CB2 receptor Cannabinoid receptor 2 (CB2R) | hCB2
Type:
G Protein-Coupled Receptor (GPCR)
Mol. Mass.:
39690.94
Organism:
Homo sapiens (Human)
Description:
P34972
Residue:
360
  
Inhibitor
Name:
BDBM50358946
Synonyms:
CHEMBL1923760
Type:
Small organic molecule
Emp. Form.:
C23H38O6
Mol. Mass.:
410.5442
SMILES:
CCCCCCc1ccc(O)cc1OCCCCCCCC(=O)OC(CO)CO
: