Target
Cannabinoid receptor 1
Ligand
BDBM50072775
Substrate
Meas. Tech.
ChEMBL_790917 (CHEMBL1926465)
EC50
42±n/a nM
Citation
 Brizzi, ACascio, MGFrosini, MLigresti, AAiello, FBiotti, IBrizzi, VPertwee, RGCorelli, FDi Marzo, V Resorcinol-sn-glycerol derivatives: novel 2-arachidonoylglycerol mimetics endowed with high affinity and selectivity for cannabinoid type 1 receptor. J Med Chem 54:8278-88 (2011)  
Target
Name:
Cannabinoid receptor 1
Synonyms:
Brain-type cannabinoid receptor CB-R CNR1_MOUSE Cannabinoid receptor | Cnr1
Type:
Enzyme
Mol. Mass.:
52842.52
Organism:
Mus musculus (Mouse)
Description:
P47746
Residue:
473
  
Inhibitor
Name:
BDBM50072775
Synonyms:
2-((1R,2R,5R)-5-hydroxy-2-(3-hydroxypropyl)cyclohexyl)-5-(2-methyloctan-2-yl)phenol 5-(1,1-Dimethyl-heptyl)-2-[(4R,6R)-5-hydroxy-2-((R)-3-hydroxy-propyl)-cyclohexyl]-phenol CP-55940 CP55,940 ChEMBL_75020
Type:
Small organic molecule
Emp. Form.:
C24H40O3
Mol. Mass.:
376.5726
SMILES:
CCCCCCC(C)(C)c1ccc([C@@H]2C[C@H](O)CC[C@H]2CCCO)c(O)c1
: