Target
DNA topoisomerase 1
Ligand
BDBM50359313
Substrate
Meas. Tech.
ChEMBL_794329 (CHEMBL1932251)
IC50
180000±n/a nM
Citation
 Tselepi, MPapachristou, EEmmanouilidi, AAngelis, AAligiannis, NSkaltsounis, ALKouretas, DLiadaki, K Catalytic inhibition of eukaryotic topoisomerases I and II by flavonol glycosides extracted from Vicia faba and Lotus edulis. J Nat Prod 74:2362-70 (2011)  
Target
Name:
DNA topoisomerase 1
Synonyms:
DNA topoisomerase I TOP1 | TOP1_HUMAN
Type:
Enzyme
Mol. Mass.:
90771.02
Organism:
Homo sapiens (Human)
Description:
P11387
Residue:
765
  
Inhibitor
Name:
BDBM50359313
Synonyms:
CHEMBL1929192
Type:
Small organic molecule
Emp. Form.:
C27H30O15
Mol. Mass.:
594.5181
SMILES:
C[C@@H]1O[C@@H](Oc2cc(O)c3c(c2)oc(-c2ccc(O)cc2)c(O[C@@H]2O[C@H](CO)[C@H](O)[C@H](O)[C@H]2O)c3=O)[C@H](O)[C@H](O)[C@H]1O
: