Target
DNA topoisomerase 2-alpha
Ligand
BDBM50359314
Substrate
Meas. Tech.
ChEMBL_794336 (CHEMBL1932258)
IC50
600000±n/a nM
Citation
 Tselepi, MPapachristou, EEmmanouilidi, AAngelis, AAligiannis, NSkaltsounis, ALKouretas, DLiadaki, K Catalytic inhibition of eukaryotic topoisomerases I and II by flavonol glycosides extracted from Vicia faba and Lotus edulis. J Nat Prod 74:2362-70 (2011)  
Target
Name:
DNA topoisomerase 2-alpha
Synonyms:
DNA topoisomerase 2-alpha DNA topoisomerase II (Topo II) DNA topoisomerase II, alpha isozyme TOP2A Topoisomerase I/II | Topoisomerase II alpha (HuTopoIIα)
Type:
Protein
Mol. Mass.:
174415.30
Organism:
Homo sapiens (Human)
Description:
P11388
Residue:
1531
  
Inhibitor
Name:
BDBM50359314
Synonyms:
CHEMBL1929193
Type:
Small organic molecule
Emp. Form.:
C27H30O15
Mol. Mass.:
594.5181
SMILES:
C[C@@H]1O[C@@H](Oc2cc(O)c3c(c2)oc(-c2ccc(O)cc2)c(O[C@@H]2O[C@H](CO)[C@@H](O)[C@H](O)[C@H]2O)c3=O)[C@H](O)[C@H](O)[C@H]1O
: