Target
Cell division protein FtsZ
Ligand
BDBM50359412
Substrate
Meas. Tech.
ChEMBL_793371 (CHEMBL1931925)
IC50
18600±n/a nM
Citation
 Mathew, BSrivastava, SRoss, LJSuling, WJWhite, ELWoolhiser, LKLenaerts, AJReynolds, RC Novel pyridopyrazine and pyrimidothiazine derivatives as FtsZ inhibitors. Bioorg Med Chem 19:7120-8 (2011)  
Target
Name:
Cell division protein FtsZ
Synonyms:
FTSZ_MYCTU | ftsZ
Type:
PROTEIN
Mol. Mass.:
38736.30
Organism:
Mycobacterium tuberculosis
Description:
ChEMBL_1470459
Residue:
379
  
Inhibitor
Name:
BDBM50359412
Synonyms:
CHEMBL1926724
Type:
Small organic molecule
Emp. Form.:
C24H30N6O2
Mol. Mass.:
434.534
SMILES:
CCN(CC)CCCC(C)Nc1cc(N)nc2nc(-c3ccco3)c(nc12)-c1ccco1
: